Reaction Details
TargetJAK3/JAK1
LigandBDBM50021655
Substrate/Competitorn/a
Meas. Tech.ChEMBL_1368156 (CHEMBL3299204)
IC50 932±n/a nM
Citation Clark, JDFlanagan, METelliez, JB Discovery and development of Janus kinase (JAK) inhibitors for inflammatory diseases. J Med Chem57:5023-38 (2014) 
 
JAK3/JAK1
Name:JAK3/JAK1
Synonyms:Tyrosine-protein kinase JAK1/JAK3
Type:n/a
Mol. Mass.:n/a
Description:ASSAY_ID of ChEMBL is 2193386
Components:This complex has 2 components.
Component 1
Name:Tyrosine-protein kinase JAK3
Type:Protein
Mol. Mass.:125111.08
Organism:Homo sapiens (Human)
Description:P52333
Residue:1124
Component 2
Name:Tyrosine-protein kinase JAK1
Synonyms:JAK-1 JAK1A JAK1_HUMAN Janus kinase 1 (JAK1) | Janus kinase 1 JAK1
Type:Protein
Mol. Mass.:133293.73
Organism:Homo sapiens (Human)
Description:P23458
Residue:1154
BDBM50021655
NameBDBM50021655
Synonyms:DECERNOTINIB US10766894, Compound TABLE 1.2 VRT-831509 | VX-509
TypeSmall organic molecule
Emp. Form.C18H19F3N6O
Mol. Mass.392.3783
SMILESCC[C@@](C)(Nc1ccnc(n1)-c1c[nH]c2ncccc12)C(=O)NCC(F)(F)F