Reaction Details
TargetCyclin-dependent kinase 2
LigandBDBM50021716
Substrate/Competitorn/a
Meas. Tech.ChEMBL_1368656
IC50 23±n/a nM
Citation Blake, JFGaudino, JJDe Meese, JMohr, PChicarelli, MTian, HGarrey, RThomas, ASiedem, CSWelch, MBKolakowski, GKaus, RBurkard, MMartinson, MChen, HDean, BDudley, DAGould, SEPacheco, PShahidi-Latham, SWang, WWest, KYin, JMoffat, JSchwarz, JB Discovery of 5,6,7,8-tetrahydropyrido[3,4-d]pyrimidine inhibitors of Erk2. Bioorg Med Chem Lett24:2635-9 (2014) 
 
Cyclin-dependent kinase 2
Name:Cyclin-dependent kinase 2
Type:Enzyme Subunit
Mol. Mass.:33938.17
Organism:Homo sapiens (Human)
Description:P24941
Residue:298
BDBM50021716
NameBDBM50021716
Synonyms:CHEMBL3298420
TypeSmall organic molecule
Emp. Form.C19H19Cl2N7O
Mol. Mass.432.306
SMILESC[C@@H](NC(=O)N1CCc2cnc(Nc3ccn[nH]3)nc2C1)c1ccc(Cl)c(Cl)c1