Reaction Details
TargetMitogen-activated protein kinase 1
LigandBDBM50021744
Substrate/Competitorn/a
Meas. Tech.ChEMBL_1368652
IC50 3.0±n/a nM
Citation Blake, JFGaudino, JJDe Meese, JMohr, PChicarelli, MTian, HGarrey, RThomas, ASiedem, CSWelch, MBKolakowski, GKaus, RBurkard, MMartinson, MChen, HDean, BDudley, DAGould, SEPacheco, PShahidi-Latham, SWang, WWest, KYin, JMoffat, JSchwarz, JB Discovery of 5,6,7,8-tetrahydropyrido[3,4-d]pyrimidine inhibitors of Erk2. Bioorg Med Chem Lett24:2635-9 (2014) 
 
Mitogen-activated protein kinase 1
Name:Mitogen-activated protein kinase 1
Type:Ser/Thr Protein Kinase
Mol. Mass.:41392.76
Organism:Homo sapiens (Human)
Description:P28482
Residue:360
BDBM50021744
NameBDBM50021744
Synonyms:CHEMBL3298415
TypeSmall organic molecule
Emp. Form.C19H23ClFN5O3
Mol. Mass.423.869
SMILESCC(CO)Nc1ncc2CCN(Cc2n1)C(=O)N[C@H](CO)c1ccc(F)c(Cl)c1