Reaction Details
TargetBeta-3 adrenergic receptor
LigandBDBM50021865
Substrate/Competitorn/a
Meas. Tech.ChEMBL_1369178
EC50 25±n/a nM
Citation McKinnell, RMKlein, ULinsell, MSMoran, EJNodwell, MBPfeiffer, JWThomas, GRYu, CJacobsen, JR Discovery of TD-4306, a long-actingß2-agonist for the treatment of asthma and COPD. Bioorg Med Chem Lett24:2871-6 (2014) 
 
Beta-3 adrenergic receptor
Name:Beta-3 adrenergic receptor
Type:G Protein-Coupled Receptor (GPCR)
Mol. Mass.:43534.88
Organism:Homo sapiens (Human)
Description:n/a
Residue:408
BDBM50021865
NameBDBM50021865
Synonyms:CHEMBL3298325
TypeSmall organic molecule
Emp. Form.C33H34N4O4
Mol. Mass.550.6475
SMILESCOc1ccc(Nc2ccc(CCNC[C@H](O)c3ccc(O)c4[nH]c(=O)ccc34)cc2)cc1-c1cccc(CN)c1