Reaction Details
TargetMuscarinic acetylcholine receptor M1
LigandBDBM50344285
Substrate/Competitorn/a
Meas. Tech.ChEMBL_1367094
Ki 0.320000±n/a nM
Citation Nagashima, SMatsushima, YHamaguchi, HNagata, HKontani, TMoritomo, AKoshika, TTakeuchi, M Novel quinuclidinyl heteroarylcarbamate derivatives as muscarinic receptor antagonists. Bioorg Med Chem22:3478-87 (2014) 
 
Muscarinic acetylcholine receptor M1
Name:Muscarinic acetylcholine receptor M1
Type:Enzyme Catalytic Domain
Mol. Mass.:51390.46
Organism:RAT
Description:P08482
Residue:460
BDBM50344285
NameBDBM50344285
Synonyms:CHEMBL1779047 | quinuclidin-4-yl biphenyl-2-ylcarbamate hydrochloride
TypeSmall organic molecule
Emp. Form.C20H22N2O2
Mol. Mass.322.4009
SMILESO=C(Nc1ccccc1-c1ccccc1)OC12CCN(CC1)CC2