Reaction Details
TargetMuscarinic acetylcholine receptor M2
LigandBDBM50021910
Substrate/Competitorn/a
Meas. Tech.ChEMBL_1367095
Ki 1.9±n/a nM
Citation Nagashima, SMatsushima, YHamaguchi, HNagata, HKontani, TMoritomo, AKoshika, TTakeuchi, M Novel quinuclidinyl heteroarylcarbamate derivatives as muscarinic receptor antagonists. Bioorg Med Chem22:3478-87 (2014) 
 
Muscarinic acetylcholine receptor M2
Name:Muscarinic acetylcholine receptor M2
Type:Enzyme Catalytic Domain
Mol. Mass.:51555.53
Organism:RAT
Description:P10980
Residue:466
BDBM50021910
NameBDBM50021910
Synonyms:CHEMBL3298592
TypeSmall organic molecule
Emp. Form.C17H20ClN3O2S
Mol. Mass.365.878
SMILESCl.O=C(Nc1ncsc1-c1ccccc1)O[C@H]1CN2CCC1CC2