Reaction Details
TargetMuscarinic acetylcholine receptor M3
LigandBDBM50344285
Substrate/Competitorn/a
Meas. Tech.ChEMBL_1367096
Ki 0.140000±n/a nM
Citation Nagashima, SMatsushima, YHamaguchi, HNagata, HKontani, TMoritomo, AKoshika, TTakeuchi, M Novel quinuclidinyl heteroarylcarbamate derivatives as muscarinic receptor antagonists. Bioorg Med Chem22:3478-87 (2014) 
 
Muscarinic acetylcholine receptor M3
Name:Muscarinic acetylcholine receptor M3
Type:Enzyme Catalytic Domain
Mol. Mass.:66086.66
Organism:RAT
Description:Cholinergic, muscarinic M3 CHRM3 RAT::P08483
Residue:589
BDBM50344285
NameBDBM50344285
Synonyms:CHEMBL1779047 | quinuclidin-4-yl biphenyl-2-ylcarbamate hydrochloride
TypeSmall organic molecule
Emp. Form.C20H22N2O2
Mol. Mass.322.4009
SMILESO=C(Nc1ccccc1-c1ccccc1)OC12CCN(CC1)CC2