Reaction Details
TargetMuscarinic acetylcholine receptor M3
LigandBDBM50021904
Substrate/Competitorn/a
Meas. Tech.ChEMBL_1367096
Ki 0.056000±n/a nM
Citation Nagashima, SMatsushima, YHamaguchi, HNagata, HKontani, TMoritomo, AKoshika, TTakeuchi, M Novel quinuclidinyl heteroarylcarbamate derivatives as muscarinic receptor antagonists. Bioorg Med Chem22:3478-87 (2014) 
 
Muscarinic acetylcholine receptor M3
Name:Muscarinic acetylcholine receptor M3
Type:Enzyme Catalytic Domain
Mol. Mass.:66086.66
Organism:RAT
Description:Cholinergic, muscarinic M3 CHRM3 RAT::P08483
Residue:589
BDBM50021904
NameBDBM50021904
Synonyms:CHEMBL3298588
TypeSmall organic molecule
Emp. Form.C18H21ClN2O2S
Mol. Mass.364.89
SMILESCl.O=C(Nc1ccsc1-c1ccccc1)OC12CCN(CC1)CC2