Reaction Details
TargetMuscarinic acetylcholine receptor M3
LigandBDBM50021919
Substrate/Competitorn/a
Meas. Tech.ChEMBL_1367096
Ki 0.020000±n/a nM
Citation Nagashima, SMatsushima, YHamaguchi, HNagata, HKontani, TMoritomo, AKoshika, TTakeuchi, M Novel quinuclidinyl heteroarylcarbamate derivatives as muscarinic receptor antagonists. Bioorg Med Chem22:3478-87 (2014) 
 
Muscarinic acetylcholine receptor M3
Name:Muscarinic acetylcholine receptor M3
Type:Enzyme Catalytic Domain
Mol. Mass.:66086.66
Organism:RAT
Description:Cholinergic, muscarinic M3 CHRM3 RAT::P08483
Residue:589
BDBM50021919
NameBDBM50021919
Synonyms:CHEMBL3298595
TypeSmall organic molecule
Emp. Form.C19H23IN2O2S
Mol. Mass.470.368
SMILES[I-].C[N+]12CCC(CC1)(CC2)OC(=O)Nc1ccsc1-c1ccccc1