Reaction Details
TargetSigma non-opioid intracellular receptor 1
LigandBDBM50021999
Substrate/Competitorn/a
Meas. Tech.ChEMBL_1367242
Ki 543±n/a nM
Citation Bourgeois, CWerfel, ESchepmann, DWünsch, B Combination of cyclohexane and piperazine based¿-opioid receptor agonists: Synthesis and pharmacological evaluation of trans,trans-configured perhydroquinoxalines. Bioorg Med Chem22:3316-24 (2014) 
 
Sigma non-opioid intracellular receptor 1
Name:Sigma non-opioid intracellular receptor 1
Type:Protein
Mol. Mass.:25307.17
Organism:Cavia porcellus (Guinea pig)
Description:Q60492
Residue:223
BDBM50021999
NameBDBM50021999
Synonyms:CHEMBL3298900
TypeSmall organic molecule
Emp. Form.C22H23Cl2N3O2
Mol. Mass.432.343
SMILES[H][C@@]12CCC[C@H](NCc3ccc(Cl)cc3)[C@@]1([H])NC(=O)C(=O)N2Cc1ccc(Cl)cc1