Reaction Details
TargetAmyloid-beta precursor protein
LigandBDBM50022087
Substrate/Competitorn/a
Meas. Tech.ChEMBL_1367449
IC50 2700±n/a nM
Citation Churches, QICaine, JCavanagh, KEpa, VCWaddington, LTranberg, CEMeyer, AGVarghese, JNStreltsov, VDuggan, PJ Naturally occurring polyphenolic inhibitors of amyloid beta aggregation. Bioorg Med Chem Lett24:3108-12 (2014) 
 
Amyloid-beta precursor protein
Name:Amyloid-beta precursor protein
Type:Single-pass type I membrane protein
Mol. Mass.:86890.41
Organism:Homo sapiens (Human)
Description:P05067
Residue:770
BDBM50022087
NameBDBM50022087
Synonyms:CHEBI:6694 | CHEMBL3298066
TypeSmall organic molecule
Emp. Form.C15H10O6
Mol. Mass.286.2363
SMILESOc1ccc(\C=C2/Oc3c(ccc(O)c3O)C2=O)cc1O