Reaction Details
TargetAmyloid-beta precursor protein
LigandBDBM50022088
Substrate/Competitorn/a
Meas. Tech.ChEMBL_1367449
IC50 5400±n/a nM
Citation Churches, QICaine, JCavanagh, KEpa, VCWaddington, LTranberg, CEMeyer, AGVarghese, JNStreltsov, VDuggan, PJ Naturally occurring polyphenolic inhibitors of amyloid beta aggregation. Bioorg Med Chem Lett24:3108-12 (2014) 
 
Amyloid-beta precursor protein
Name:Amyloid-beta precursor protein
Type:Single-pass type I membrane protein
Mol. Mass.:86890.41
Organism:Homo sapiens (Human)
Description:P05067
Residue:770
BDBM50022088
NameBDBM50022088
Synonyms:CHEMBL3297746
TypeSmall organic molecule
Emp. Form.C16H12O7
Mol. Mass.316.2623
SMILESCOc1c(oc2c(O)c(O)ccc2c1=O)-c1ccc(O)c(O)c1