Reaction Details
TargetCarbonic anhydrase 1
LigandBDBM50022089
Substrate/Competitorn/a
Meas. Tech.ChEMBL_1367455 (CHEMBL3300908)
Ki 85±n/a nM
Citation Ghorab, MMAlsaid, MSCeruso, MNissan, YMSupuran, CT Carbonic anhydrase inhibitors: Synthesis, molecular docking, cytotoxic and inhibition of the human carbonic anhydrase isoforms I, II, IX, XII with novel benzenesulfonamides incorporating pyrrole, pyrrolopyrimidine and fused pyrrolopyrimidine moieties. Bioorg Med Chem22:3684-95 (2014) 
 
Carbonic anhydrase 1
Name:Carbonic anhydrase 1
Type:Enzyme
Mol. Mass.:28873.37
Organism:Homo sapiens (Human)
Description:P00915
Residue:261
BDBM50022089
NameBDBM50022089
Synonyms:CHEMBL3298343
TypeSmall organic molecule
Emp. Form.C17H13BrN4O2S
Mol. Mass.417.28
SMILESNc1c(C#N)c(cn1-c1ccc(cc1)S(N)(=O)=O)-c1ccc(Br)cc1