Reaction Details
TargetCarbonic anhydrase 1
LigandBDBM50022091
Substrate/Competitorn/a
Meas. Tech.ChEMBL_1367455 (CHEMBL3300908)
Ki 22±n/a nM
Citation Ghorab, MMAlsaid, MSCeruso, MNissan, YMSupuran, CT Carbonic anhydrase inhibitors: Synthesis, molecular docking, cytotoxic and inhibition of the human carbonic anhydrase isoforms I, II, IX, XII with novel benzenesulfonamides incorporating pyrrole, pyrrolopyrimidine and fused pyrrolopyrimidine moieties. Bioorg Med Chem22:3684-95 (2014) 
 
Carbonic anhydrase 1
Name:Carbonic anhydrase 1
Type:Enzyme
Mol. Mass.:28873.37
Organism:Homo sapiens (Human)
Description:P00915
Residue:261
BDBM50022091
NameBDBM50022091
Synonyms:CHEMBL3298345
TypeSmall organic molecule
Emp. Form.C18H15BrN6O2S
Mol. Mass.459.32
SMILESNn1cnc2n(cc(-c3ccc(Br)cc3)c2c1=N)-c1ccc(cc1)S(N)(=O)=O