Reaction Details
TargetCarbonic anhydrase 1
LigandBDBM50022101
Substrate/Competitorn/a
Meas. Tech.ChEMBL_1367455 (CHEMBL3300908)
Ki 80±n/a nM
Citation Ghorab, MMAlsaid, MSCeruso, MNissan, YMSupuran, CT Carbonic anhydrase inhibitors: Synthesis, molecular docking, cytotoxic and inhibition of the human carbonic anhydrase isoforms I, II, IX, XII with novel benzenesulfonamides incorporating pyrrole, pyrrolopyrimidine and fused pyrrolopyrimidine moieties. Bioorg Med Chem22:3684-95 (2014) 
 
Carbonic anhydrase 1
Name:Carbonic anhydrase 1
Type:Enzyme
Mol. Mass.:28873.37
Organism:Homo sapiens (Human)
Description:P00915
Residue:261
BDBM50022101
NameBDBM50022101
Synonyms:CHEMBL3298355
TypeSmall organic molecule
Emp. Form.C22H15BrN8O2S
Mol. Mass.535.376
SMILESNC1=C(C=NN2C=Nc3c(c(cn3-c3ccc(cc3)S(N)(=O)=O)-c3ccc(Br)cc3)C2=N1)C#N