Reaction Details
TargetCarbonic anhydrase 2
LigandBDBM50022097
Substrate/Competitorn/a
Meas. Tech.ChEMBL_1367456 (CHEMBL3300909)
Ki 5.3±n/a nM
Citation Ghorab, MMAlsaid, MSCeruso, MNissan, YMSupuran, CT Carbonic anhydrase inhibitors: Synthesis, molecular docking, cytotoxic and inhibition of the human carbonic anhydrase isoforms I, II, IX, XII with novel benzenesulfonamides incorporating pyrrole, pyrrolopyrimidine and fused pyrrolopyrimidine moieties. Bioorg Med Chem22:3684-95 (2014) 
 
Carbonic anhydrase 2
Name:Carbonic anhydrase 2
Type:Enzyme
Mol. Mass.:29250.71
Organism:Homo sapiens (Human)
Description:P00918
Residue:260
BDBM50022097
NameBDBM50022097
Synonyms:CHEMBL3298351
TypeSmall organic molecule
Emp. Form.C18H12BrN7O2S
Mol. Mass.470.303
SMILESNS(=O)(=O)c1ccc(cc1)-n1cc(-c2ccc(Br)cc2)c2c3nnnn3cnc12