Reaction Details
TargetCarbonic anhydrase 2
LigandBDBM50022103
Substrate/Competitorn/a
Meas. Tech.ChEMBL_1367456 (CHEMBL3300909)
Ki 8.5±n/a nM
Citation Ghorab, MMAlsaid, MSCeruso, MNissan, YMSupuran, CT Carbonic anhydrase inhibitors: Synthesis, molecular docking, cytotoxic and inhibition of the human carbonic anhydrase isoforms I, II, IX, XII with novel benzenesulfonamides incorporating pyrrole, pyrrolopyrimidine and fused pyrrolopyrimidine moieties. Bioorg Med Chem22:3684-95 (2014) 
 
Carbonic anhydrase 2
Name:Carbonic anhydrase 2
Type:Enzyme
Mol. Mass.:29250.71
Organism:Homo sapiens (Human)
Description:P00918
Residue:260
BDBM50022103
NameBDBM50022103
Synonyms:CHEMBL3298839
TypeSmall organic molecule
Emp. Form.C26H16BrN7O2S
Mol. Mass.570.42
SMILESNS(=O)(=O)c1ccc(cc1)-n1cc(-c2ccc(Br)cc2)c2c1ncn1nc3c(nc4ccccc34)nc21