Reaction Details
TargetCarbonic anhydrase 9
LigandBDBM50022090
Substrate/Competitorn/a
Meas. Tech.ChEMBL_1367457 (CHEMBL3300910)
Ki 3.9±n/a nM
Citation Ghorab, MMAlsaid, MSCeruso, MNissan, YMSupuran, CT Carbonic anhydrase inhibitors: Synthesis, molecular docking, cytotoxic and inhibition of the human carbonic anhydrase isoforms I, II, IX, XII with novel benzenesulfonamides incorporating pyrrole, pyrrolopyrimidine and fused pyrrolopyrimidine moieties. Bioorg Med Chem22:3684-95 (2014) 
 
Carbonic anhydrase 9
Name:Carbonic anhydrase 9
Type:Enzyme
Mol. Mass.:49669.03
Organism:Homo sapiens (Human)
Description:Catalytic domain of human cloned isozyme was used in the assay
Residue:459
BDBM50022090
NameBDBM50022090
Synonyms:CHEMBL3298344
TypeSmall organic molecule
Emp. Form.C20H17BrN4O3S
Mol. Mass.473.343
SMILESCCO\C=N\c1c(C#N)c(cn1-c1ccc(cc1)S(N)(=O)=O)-c1ccc(Br)cc1