Reaction Details
TargetCarbonic anhydrase 9
LigandBDBM50022097
Substrate/Competitorn/a
Meas. Tech.ChEMBL_1367457 (CHEMBL3300910)
Ki 2.8±n/a nM
Citation Ghorab, MMAlsaid, MSCeruso, MNissan, YMSupuran, CT Carbonic anhydrase inhibitors: Synthesis, molecular docking, cytotoxic and inhibition of the human carbonic anhydrase isoforms I, II, IX, XII with novel benzenesulfonamides incorporating pyrrole, pyrrolopyrimidine and fused pyrrolopyrimidine moieties. Bioorg Med Chem22:3684-95 (2014) 
 
Carbonic anhydrase 9
Name:Carbonic anhydrase 9
Type:Enzyme
Mol. Mass.:49669.03
Organism:Homo sapiens (Human)
Description:Catalytic domain of human cloned isozyme was used in the assay
Residue:459
BDBM50022097
NameBDBM50022097
Synonyms:CHEMBL3298351
TypeSmall organic molecule
Emp. Form.C18H12BrN7O2S
Mol. Mass.470.303
SMILESNS(=O)(=O)c1ccc(cc1)-n1cc(-c2ccc(Br)cc2)c2c3nnnn3cnc12