Reaction Details
TargetCarbonic anhydrase 9
LigandBDBM50022104
Substrate/Competitorn/a
Meas. Tech.ChEMBL_1367457 (CHEMBL3300910)
Ki 3.1±n/a nM
Citation Ghorab, MMAlsaid, MSCeruso, MNissan, YMSupuran, CT Carbonic anhydrase inhibitors: Synthesis, molecular docking, cytotoxic and inhibition of the human carbonic anhydrase isoforms I, II, IX, XII with novel benzenesulfonamides incorporating pyrrole, pyrrolopyrimidine and fused pyrrolopyrimidine moieties. Bioorg Med Chem22:3684-95 (2014) 
 
Carbonic anhydrase 9
Name:Carbonic anhydrase 9
Type:Enzyme
Mol. Mass.:49669.03
Organism:Homo sapiens (Human)
Description:Catalytic domain of human cloned isozyme was used in the assay
Residue:459
BDBM50022104
NameBDBM50022104
Synonyms:CHEMBL3298840
TypeSmall organic molecule
Emp. Form.C28H20BrN7O4S
Mol. Mass.630.472
SMILESCC(=O)N1C(=O)\C(=N/n2cnc3n(cc(-c4ccc(Br)cc4)c3c2=N)-c2ccc(cc2)S(N)(=O)=O)c2ccccc12