Reaction Details
TargetCarbonic anhydrase 12
LigandBDBM50022102
Substrate/Competitorn/a
Meas. Tech.ChEMBL_1367458 (CHEMBL3300911)
Ki 0.830000±n/a nM
Citation Ghorab, MMAlsaid, MSCeruso, MNissan, YMSupuran, CT Carbonic anhydrase inhibitors: Synthesis, molecular docking, cytotoxic and inhibition of the human carbonic anhydrase isoforms I, II, IX, XII with novel benzenesulfonamides incorporating pyrrole, pyrrolopyrimidine and fused pyrrolopyrimidine moieties. Bioorg Med Chem22:3684-95 (2014) 
 
Carbonic anhydrase 12
Name:Carbonic anhydrase 12
Type:Enzyme
Mol. Mass.:39456.00
Organism:Homo sapiens (Human)
Description:Catalytic domain of human cloned isozyme was used in the assay
Residue:354
BDBM50022102
NameBDBM50022102
Synonyms:CHEMBL3298838
TypeSmall organic molecule
Emp. Form.C24H20BrN7O4S
Mol. Mass.582.429
SMILESCCOC(=O)C1=C(N)N=C2N(C=Nc3c2c(cn3-c2ccc(cc2)S(N)(=O)=O)-c2ccc(Br)cc2)N=C1