Reaction Details
TargetCarbonic anhydrase 12
LigandBDBM50022103
Substrate/Competitorn/a
Meas. Tech.ChEMBL_1367458 (CHEMBL3300911)
Ki 0.720000±n/a nM
Citation Ghorab, MMAlsaid, MSCeruso, MNissan, YMSupuran, CT Carbonic anhydrase inhibitors: Synthesis, molecular docking, cytotoxic and inhibition of the human carbonic anhydrase isoforms I, II, IX, XII with novel benzenesulfonamides incorporating pyrrole, pyrrolopyrimidine and fused pyrrolopyrimidine moieties. Bioorg Med Chem22:3684-95 (2014) 
 
Carbonic anhydrase 12
Name:Carbonic anhydrase 12
Type:Enzyme
Mol. Mass.:39456.00
Organism:Homo sapiens (Human)
Description:Catalytic domain of human cloned isozyme was used in the assay
Residue:354
BDBM50022103
NameBDBM50022103
Synonyms:CHEMBL3298839
TypeSmall organic molecule
Emp. Form.C26H16BrN7O2S
Mol. Mass.570.42
SMILESNS(=O)(=O)c1ccc(cc1)-n1cc(-c2ccc(Br)cc2)c2c1ncn1nc3c(nc4ccccc34)nc21