Reaction Details
TargetChitinase
LigandBDBM50022832
Substrate/Competitorn/a
Meas. Tech.ChEMBL_1369102 (CHEMBL3300323)
Ki 130±n/a nM
Citation Gooyit, MTricoche, NLustigman, SJanda, KD Dual protonophore-chitinase inhibitors dramatically affect O. volvulus molting. J Med Chem57:5792-9 (2014) 
 
Chitinase
Name:Chitinase
Synonyms:n/a
Type:PROTEIN
Mol. Mass.:55694.80
Organism:Onchocerca volvulus
Description:ChEMBL_1369100
Residue:497
BDBM50022832
NameBDBM50022832
Synonyms:Rafoxanide
TypeSmall organic molecule
Emp. Form.C19H11Cl2I2NO3
Mol. Mass.626.01
SMILESOc1c(I)cc(I)cc1C(=O)Nc1ccc(Oc2ccc(Cl)cc2)c(Cl)c1