Reaction Details
Target17-beta-hydroxysteroid dehydrogenase type 1
LigandBDBM50330988
Substrate/Competitorn/a
Meas. Tech.ChEMBL_1367282 (CHEMBL3300203)
IC50 22±n/a nM
Citation Abdelsamie, ASBey, EHanke, NEmpting, MHartmann, RWFrotscher, M Inhibition of 17ß-HSD1: SAR of bicyclic substituted hydroxyphenylmethanones and discovery of new potent inhibitors with thioether linker. Eur J Med Chem82:394-406 (2014) 
 
17-beta-hydroxysteroid dehydrogenase type 1
Name:17-beta-hydroxysteroid dehydrogenase type 1
Type:Enzyme
Mol. Mass.:34945.13
Organism:Homo sapiens (Human)
Description:P14061
Residue:328
BDBM50330988
NameBDBM50330988
Synonyms:(3-hydroxyphenyl)(5-(3-hydroxyphenyl)thiophen-2-yl)methanone | CHEMBL1277249
TypeSmall organic molecule
Emp. Form.C17H12O3S
Mol. Mass.296.34
SMILESOc1cccc(c1)C(=O)c1ccc(s1)-c1cccc(O)c1