Reaction Details
Target1,25-dihydroxyvitamin D(3) 24-hydroxylase, mitochondrial
LigandBDBM50023360
Substrate/Competitorn/a
Meas. Tech.ChEMBL_1459633 (CHEMBL3369890)
Ki 42±n/a nM
Citation Ferla, SAboraia, ASBrancale, APepper, CJZhu, JOchalek, JTDeLuca, HFSimons, C Small-molecule inhibitors of 25-hydroxyvitamin D-24-hydroxylase (CYP24A1): synthesis and biological evaluation. J Med Chem57:7702-15 (2014) 
 
1,25-dihydroxyvitamin D(3) 24-hydroxylase, mitochondrial
Name:1,25-dihydroxyvitamin D(3) 24-hydroxylase, mitochondrial
Type:Protein
Mol. Mass.:58889.66
Organism:Homo sapiens (Human)
Description:Q07973
Residue:514
BDBM50023360
NameBDBM50023360
Synonyms:CHEMBL3329779
TypeSmall organic molecule
Emp. Form.C24H28N2O
Mol. Mass.360.4919
SMILESCC(C)(C)C(=O)C(Cc1ccc(CCc2ccccc2)cc1)n1ccnc1