Reaction Details
Target25-hydroxyvitamin D-1 alpha hydroxylase, mitochondrial
LigandBDBM50023355
Substrate/Competitorn/a
Meas. Tech.ChEMBL_1459634 (CHEMBL3369891)
IC50 200±n/a nM
Citation Ferla, SAboraia, ASBrancale, APepper, CJZhu, JOchalek, JTDeLuca, HFSimons, C Small-molecule inhibitors of 25-hydroxyvitamin D-24-hydroxylase (CYP24A1): synthesis and biological evaluation. J Med Chem57:7702-15 (2014) 
 
25-hydroxyvitamin D-1 alpha hydroxylase, mitochondrial
Name:25-hydroxyvitamin D-1 alpha hydroxylase, mitochondrial
Type:PROTEIN
Mol. Mass.:56238.51
Organism:Mus musculus
Description:ChEMBL_109473
Residue:507
BDBM50023355
NameBDBM50023355
Synonyms:CHEMBL3329774
TypeSmall organic molecule
Emp. Form.C27H32N2O4
Mol. Mass.448.554
SMILESCOc1cc(OC)cc(\C=C\c2ccc(CCC(OC(=O)n3ccnc3)C(C)(C)C)cc2)c1