Reaction Details
Target1,25-dihydroxyvitamin D(3) 24-hydroxylase, mitochondrial
LigandBDBM50370925
Substrate/Competitorn/a
Meas. Tech.ChEMBL_1459633 (CHEMBL3369890)
IC50 6.5±n/a nM
Citation Ferla, SAboraia, ASBrancale, APepper, CJZhu, JOchalek, JTDeLuca, HFSimons, C Small-molecule inhibitors of 25-hydroxyvitamin D-24-hydroxylase (CYP24A1): synthesis and biological evaluation. J Med Chem57:7702-15 (2014) 
 
1,25-dihydroxyvitamin D(3) 24-hydroxylase, mitochondrial
Name:1,25-dihydroxyvitamin D(3) 24-hydroxylase, mitochondrial
Type:Protein
Mol. Mass.:58889.66
Organism:Homo sapiens (Human)
Description:Q07973
Residue:514
BDBM50370925
NameBDBM50370925
Synonyms:CHEMBL1627233
TypeSmall organic molecule
Emp. Form.C29H41NO3S
Mol. Mass.483.706
SMILESC[C@H](CC=S(N)(=O)c1ccccc1)[C@H]1CC[C@H]2\C(CCC[C@]12C)=C\C=C1\C[C@@H](O)C[C@H](O)C1=C