Reaction Details
TargetCarbonic anhydrase 12
LigandBDBM50294475
Substrate/Competitorn/a
Meas. Tech.ChEMBL_1454280 (CHEMBL3363830)
Ki 73±n/a nM
Citation Riafrecha, LERodríguez, OMVullo, DSupuran, CTColinas, PA Attachment of carbohydrates to methoxyaryl moieties leads to highly selective inhibitors of the cancer associated carbonic anhydrase isoforms IX and XII. Bioorg Med Chem22:5308-14 (2014) 
 
Carbonic anhydrase 12
Name:Carbonic anhydrase 12
Type:Enzyme
Mol. Mass.:39456.00
Organism:Homo sapiens (Human)
Description:Catalytic domain of human cloned isozyme was used in the assay
Residue:354
BDBM50294475
NameBDBM50294475
Synonyms:(E)-4-(3,4-dimethoxyphenyl)-1-((2S,3R,4R,5S,6R)-3,4,5-trihydroxy-6-(hydroxymethyl)tetrahydro-2H-pyran-2-yl)but-3-en-2-one | CHEMBL562109
TypeSmall organic molecule
Emp. Form.C18H24O8
Mol. Mass.368.3784
SMILESCOc1ccc(C=CC(=O)C[C@@H]2O[C@H](CO)[C@@H](O)[C@H](O)[C@H]2O)cc1OC