Reaction Details
TargetCarbonic anhydrase 1
LigandBDBM50023596
Substrate/Competitorn/a
Meas. Tech.ChEMBL_1454277 (CHEMBL3363827)
Ki 4670±n/a nM
Citation Riafrecha, LERodríguez, OMVullo, DSupuran, CTColinas, PA Attachment of carbohydrates to methoxyaryl moieties leads to highly selective inhibitors of the cancer associated carbonic anhydrase isoforms IX and XII. Bioorg Med Chem22:5308-14 (2014) 
 
Carbonic anhydrase 1
Name:Carbonic anhydrase 1
Type:Enzyme
Mol. Mass.:28873.37
Organism:Homo sapiens (Human)
Description:P00915
Residue:261
BDBM50023596
NameBDBM50023596
Synonyms:CHEMBL3329925
TypeSmall organic molecule
Emp. Form.C26H32O12
Mol. Mass.536.5251
SMILESCOc1ccc(\C=C\C(=O)C[C@@H]2O[C@H](COC(C)=O)[C@H](OC(C)=O)[C@H](OC(C)=O)[C@H]2OC(C)=O)cc1OC