Reaction Details
TargetCarbonic anhydrase 2
LigandBDBM50294475
Substrate/Competitorn/a
Meas. Tech.ChEMBL_1454278 (CHEMBL3363828)
Ki 438±n/a nM
Citation Riafrecha, LERodríguez, OMVullo, DSupuran, CTColinas, PA Attachment of carbohydrates to methoxyaryl moieties leads to highly selective inhibitors of the cancer associated carbonic anhydrase isoforms IX and XII. Bioorg Med Chem22:5308-14 (2014) 
 
Carbonic anhydrase 2
Name:Carbonic anhydrase 2
Type:Enzyme
Mol. Mass.:29250.71
Organism:Homo sapiens (Human)
Description:P00918
Residue:260
BDBM50294475
NameBDBM50294475
Synonyms:(E)-4-(3,4-dimethoxyphenyl)-1-((2S,3R,4R,5S,6R)-3,4,5-trihydroxy-6-(hydroxymethyl)tetrahydro-2H-pyran-2-yl)but-3-en-2-one | CHEMBL562109
TypeSmall organic molecule
Emp. Form.C18H24O8
Mol. Mass.368.3784
SMILESCOc1ccc(C=CC(=O)C[C@@H]2O[C@H](CO)[C@@H](O)[C@H](O)[C@H]2O)cc1OC