Reaction Details
TargetCarbonic anhydrase 9
LigandBDBM50023601
Substrate/Competitorn/a
Meas. Tech.ChEMBL_1454279 (CHEMBL3363829)
Ki 673±n/a nM
Citation Riafrecha, LERodríguez, OMVullo, DSupuran, CTColinas, PA Attachment of carbohydrates to methoxyaryl moieties leads to highly selective inhibitors of the cancer associated carbonic anhydrase isoforms IX and XII. Bioorg Med Chem22:5308-14 (2014) 
 
Carbonic anhydrase 9
Name:Carbonic anhydrase 9
Type:Enzyme
Mol. Mass.:49669.03
Organism:Homo sapiens (Human)
Description:Catalytic domain of human cloned isozyme was used in the assay
Residue:459
BDBM50023601
NameBDBM50023601
Synonyms:CHEMBL3329923
TypeSmall organic molecule
Emp. Form.C29H32O11
Mol. Mass.556.5578
SMILESCOc1ccc2cc(\C=C\C(=O)C[C@@H]3O[C@H](COC(C)=O)[C@@H](OC(C)=O)[C@H](OC(C)=O)[C@H]3OC(C)=O)ccc2c1