Reaction Details
TargetCarbonic anhydrase 9
LigandBDBM50023594
Substrate/Competitorn/a
Meas. Tech.ChEMBL_1454279 (CHEMBL3363829)
Ki 615±n/a nM
Citation Riafrecha, LERodríguez, OMVullo, DSupuran, CTColinas, PA Attachment of carbohydrates to methoxyaryl moieties leads to highly selective inhibitors of the cancer associated carbonic anhydrase isoforms IX and XII. Bioorg Med Chem22:5308-14 (2014) 
 
Carbonic anhydrase 9
Name:Carbonic anhydrase 9
Type:Enzyme
Mol. Mass.:49669.03
Organism:Homo sapiens (Human)
Description:Catalytic domain of human cloned isozyme was used in the assay
Residue:459
BDBM50023594
NameBDBM50023594
Synonyms:CHEMBL3329927
TypeSmall organic molecule
Emp. Form.C17H22O7
Mol. Mass.338.3524
SMILESCOc1cccc(\C=C\C(=O)C[C@@H]2O[C@H](CO)[C@@H](O)[C@H](O)[C@H]2O)c1