Reaction Details
TargetCarbonic anhydrase 9
LigandBDBM50023604
Substrate/Competitorn/a
Meas. Tech.ChEMBL_1454279 (CHEMBL3363829)
Ki 936±n/a nM
Citation Riafrecha, LERodríguez, OMVullo, DSupuran, CTColinas, PA Attachment of carbohydrates to methoxyaryl moieties leads to highly selective inhibitors of the cancer associated carbonic anhydrase isoforms IX and XII. Bioorg Med Chem22:5308-14 (2014) 
 
Carbonic anhydrase 9
Name:Carbonic anhydrase 9
Type:Enzyme
Mol. Mass.:49669.03
Organism:Homo sapiens (Human)
Description:Catalytic domain of human cloned isozyme was used in the assay
Residue:459
BDBM50023604
NameBDBM50023604
Synonyms:CHEMBL3329930
TypeSmall organic molecule
Emp. Form.C18H24O8
Mol. Mass.368.3784
SMILESCOc1ccc(\C=C\C(=O)C[C@@H]2O[C@H](CO)[C@H](O)[C@H](O)[C@H]2O)cc1OC