Reaction Details
TargetNeurotensin receptor type 2
LigandBDBM50023627
Substrate/Competitorn/a
Meas. Tech.ChEMBL_1455172 (CHEMBL3361464)
Ki 1504±n/a nM
Citation Thomas, JBGiddings, AMWiethe, RWOlepu, SWarner, KRSarret, PGendron, LLongpre, JMZhang, YRunyon, SPGilmour, BP Identification of N-[(5-{[(4-methylphenyl)sulfonyl]amino}-3-(trifluoroacetyl)-1H-indol-1-yl)acetyl]-l-leucine (NTRC-824), a neurotensin-like nonpeptide compound selective for the neurotensin receptor type 2. J Med Chem57:7472-7 (2014) 
 
Neurotensin receptor type 2
Name:Neurotensin receptor type 2
Type:PROTEIN
Mol. Mass.:46280.50
Organism:Rattus norvegicus
Description:ChEMBL_1466615
Residue:416
BDBM50023627
NameBDBM50023627
Synonyms:CHEMBL3326832
TypeSmall organic molecule
Emp. Form.C23H27N3O5S
Mol. Mass.457.543
SMILESCC(C)C[C@H](NC(=O)Cn1ccc2cc(NS(=O)(=O)c3ccc(C)cc3)ccc12)C(O)=O