Reaction Details
TargetCannabinoid receptor 2
LigandBDBM50023631
Substrate/Competitorn/a
Meas. Tech.ChEMBL_1456019 (CHEMBL3366075)
IC50>10000±n/a nM
Citation German, NDecker, AMGilmour, BPGay, EAWiley, JLThomas, BFZhang, Y Diarylureas as allosteric modulators of the cannabinoid CB1 receptor: structure-activity relationship studies on 1-(4-chlorophenyl)-3-{3-[6-(pyrrolidin-1-yl)pyridin-2-yl]phenyl}urea (PSNCBAM-1). J Med Chem57:7758-69 (2014) 
 
Cannabinoid receptor 2
Name:Cannabinoid receptor 2
Type:G Protein-Coupled Receptor (GPCR)
Mol. Mass.:39690.94
Organism:Homo sapiens (Human)
Description:P34972
Residue:360
BDBM50023631
NameBDBM50023631
Synonyms:CHEMBL3341872
TypeSmall organic molecule
Emp. Form.C23H23ClN4O
Mol. Mass.406.908
SMILESClc1ccc(NC(=O)Nc2cccc(c2)-c2cccc(NC3CCCC3)n2)cc1