Reaction Details
TargetCannabinoid receptor 1
LigandBDBM50023665
Substrate/Competitorn/a
Meas. Tech.ChEMBL_1456022 (CHEMBL3366078)
EC50 663±n/a nM
Citation German, NDecker, AMGilmour, BPGay, EAWiley, JLThomas, BFZhang, Y Diarylureas as allosteric modulators of the cannabinoid CB1 receptor: structure-activity relationship studies on 1-(4-chlorophenyl)-3-{3-[6-(pyrrolidin-1-yl)pyridin-2-yl]phenyl}urea (PSNCBAM-1). J Med Chem57:7758-69 (2014) 
 
Cannabinoid receptor 1
Name:Cannabinoid receptor 1
Type:G Protein-Coupled Receptor (GPCR)
Mol. Mass.:52868.96
Organism:Homo sapiens (Human)
Description:P21554
Residue:472
BDBM50023665
NameBDBM50023665
Synonyms:CHEMBL3341759
TypeSmall organic molecule
Emp. Form.C20H19ClN4O
Mol. Mass.366.844
SMILESCN(C)c1cccc(n1)-c1cccc(NC(=O)Nc2ccc(Cl)cc2)c1