Reaction Details
TargetAmine oxidase [flavin-containing] A
LigandBDBM50023741
Substrate/Competitorn/a
Meas. Tech.ChEMBL_1434487 (CHEMBL3388873)
IC50 21±n/a nM
Citation Vianello, PBotrugno, OACappa, ACiossani, GDessanti, PMai, AMattevi, AMeroni, GMinucci, SThaler, FTortorici, MTrifiró, PValente, SVilla, MVarasi, MMercurio, C Synthesis, biological activity and mechanistic insights of 1-substituted cyclopropylamine derivatives: a novel class of irreversible inhibitors of histone demethylase KDM1A. Eur J Med Chem86:352-63 (2014) 
 
Amine oxidase [flavin-containing] A
Name:Amine oxidase [flavin-containing] A
Type:Protein
Mol. Mass.:59689.53
Organism:Homo sapiens (Human)
Description:P21397
Residue:527
BDBM50023741
NameBDBM50023741
Synonyms:CHEMBL3330334
TypeSmall organic molecule
Emp. Form.C17H20ClN
Mol. Mass.273.8
SMILESCl.N[C@]1(CCc2ccccc2)C[C@H]1c1ccccc1