Reaction Details
TargetCytochrome P450 11B1, mitochondrial
LigandBDBM50023763
Substrate/Competitorn/a
Meas. Tech.ChEMBL_1434492 (CHEMBL3388878)
IC50 6.0±n/a nM
Citation Zhu, WHu, QHanke, Nvan Koppen, CJHartmann, RW Potent 11ß-hydroxylase inhibitors with inverse metabolic stability in human plasma and hepatic S9 fractions to promote wound healing. J Med Chem57:7811-7 (2014) 
 
Cytochrome P450 11B1, mitochondrial
Name:Cytochrome P450 11B1, mitochondrial
Type:Enzyme
Mol. Mass.:57591.44
Organism:Homo sapiens (Human)
Description:P15538
Residue:503
BDBM50023763
NameBDBM50023763
Synonyms:CHEMBL3337694
TypeSmall organic molecule
Emp. Form.C22H22N2O3S
Mol. Mass.394.487
SMILESCOc1cccc(c1)S(=O)(=O)N1CCCc2cc(Cc3ccncc3)ccc12