Reaction Details
TargetAminopeptidase N
LigandBDBM50025044
Substrate/Competitorn/a
Meas. Tech.ChEMBL_1442054 (CHEMBL3373422)
Ki 24±n/a nM
Citation Vassiliou, SWeglarz-Tomczak, EBerlicki, LPawelczak, MNocek, BMulligan, RJoachimiak, AMucha, A Structure-guided, single-point modifications in the phosphinic dipeptide structure yield highly potent and selective inhibitors of neutral aminopeptidases. J Med Chem57:8140-51 (2014) 
 
Aminopeptidase N
Name:Aminopeptidase N
Type:PROTEIN
Mol. Mass.:109522.63
Organism:Homo sapiens (Human)
Description:ChEMBL_1507526
Residue:967
BDBM50025044
NameBDBM50025044
Synonyms:CHEMBL3355103
TypeSmall organic molecule
Emp. Form.C19H24NO5P
Mol. Mass.377.3713
SMILESNC(CCc1ccc(O)cc1)P(O)(=O)CC(Cc1ccccc1)C(O)=O