Reaction Details
TargetAminopeptidase N
LigandBDBM50025047
Substrate/Competitorn/a
Meas. Tech.ChEMBL_1442054 (CHEMBL3373422)
Ki 4.8±n/a nM
Citation Vassiliou, SWeglarz-Tomczak, EBerlicki, LPawelczak, MNocek, BMulligan, RJoachimiak, AMucha, A Structure-guided, single-point modifications in the phosphinic dipeptide structure yield highly potent and selective inhibitors of neutral aminopeptidases. J Med Chem57:8140-51 (2014) 
 
Aminopeptidase N
Name:Aminopeptidase N
Type:PROTEIN
Mol. Mass.:109522.63
Organism:Homo sapiens (Human)
Description:ChEMBL_1507526
Residue:967
BDBM50025047
NameBDBM50025047
Synonyms:CHEMBL3355100
TypeSmall organic molecule
Emp. Form.C21H28NO4P
Mol. Mass.389.4251
SMILESCc1cc(C)cc(CCC(N)P(O)(=O)CC(Cc2ccccc2)C(O)=O)c1