Reaction Details
TargetAminopeptidase N
LigandBDBM50024594
Substrate/Competitorn/a
Meas. Tech.ChEMBL_1442055 (CHEMBL3373423)
Ki 53±n/a nM
Citation Vassiliou, SWeglarz-Tomczak, EBerlicki, LPawelczak, MNocek, BMulligan, RJoachimiak, AMucha, A Structure-guided, single-point modifications in the phosphinic dipeptide structure yield highly potent and selective inhibitors of neutral aminopeptidases. J Med Chem57:8140-51 (2014) 
 
Aminopeptidase N
Name:Aminopeptidase N
Type:Protein
Mol. Mass.:108810.25
Organism:Sus scrofa (Pig)
Description:P15145
Residue:963
BDBM50024594
NameBDBM50024594
Synonyms:(R)-1-Ammonium-3-methyl-butane-1-phosphonic acid anion LEUCINE PHOSPHONIC ACID
TypeSmall organic molecule
Emp. Form.C5H14NO3P
Mol. Mass.167.1433
SMILESCC(C)C[C@H]([NH3+])P(O)([O-])=O