Reaction Details
TargetAminopeptidase N
LigandBDBM50025043
Substrate/Competitorn/a
Meas. Tech.ChEMBL_1442055 (CHEMBL3373423)
Ki 42±n/a nM
Citation Vassiliou, SWeglarz-Tomczak, EBerlicki, LPawelczak, MNocek, BMulligan, RJoachimiak, AMucha, A Structure-guided, single-point modifications in the phosphinic dipeptide structure yield highly potent and selective inhibitors of neutral aminopeptidases. J Med Chem57:8140-51 (2014) 
 
Aminopeptidase N
Name:Aminopeptidase N
Type:Protein
Mol. Mass.:108810.25
Organism:Sus scrofa (Pig)
Description:P15145
Residue:963
BDBM50025043
NameBDBM50025043
Synonyms:CHEMBL3355104
TypeSmall organic molecule
Emp. Form.C20H26NO5P
Mol. Mass.391.3979
SMILESNC(CCc1ccc(CO)cc1)P(O)(=O)CC(Cc1ccccc1)C(O)=O