Reaction Details
TargetAminopeptidase N
LigandBDBM50025042
Substrate/Competitorn/a
Meas. Tech.ChEMBL_1442055 (CHEMBL3373423)
Ki 19±n/a nM
Citation Vassiliou, SWeglarz-Tomczak, EBerlicki, LPawelczak, MNocek, BMulligan, RJoachimiak, AMucha, A Structure-guided, single-point modifications in the phosphinic dipeptide structure yield highly potent and selective inhibitors of neutral aminopeptidases. J Med Chem57:8140-51 (2014) 
 
Aminopeptidase N
Name:Aminopeptidase N
Type:Protein
Mol. Mass.:108810.25
Organism:Sus scrofa (Pig)
Description:P15145
Residue:963
BDBM50025042
NameBDBM50025042
Synonyms:CHEMBL3355105
TypeSmall organic molecule
Emp. Form.C18H23N2O4P
Mol. Mass.362.36
SMILESNC(CCc1cccnc1)P(O)(=O)CC(Cc1ccccc1)C(O)=O