Reaction Details
TargetCytosol aminopeptidase [33-68,L62W]
LigandBDBM50129684
Substrate/Competitorn/a
Meas. Tech.ChEMBL_1442056 (CHEMBL3373424)
Ki 66±n/a nM
Citation Vassiliou, SWeglarz-Tomczak, EBerlicki, LPawelczak, MNocek, BMulligan, RJoachimiak, AMucha, A Structure-guided, single-point modifications in the phosphinic dipeptide structure yield highly potent and selective inhibitors of neutral aminopeptidases. J Med Chem57:8140-51 (2014) 
 
Cytosol aminopeptidase [33-68,L62W]
Name:Cytosol aminopeptidase [33-68,L62W]
Type:Enzyme
Mol. Mass.:4015.44
Organism:Sus scrofa (Pig)
Description:P28839[33-68,L62W]
Residue:36
BDBM50129684
NameBDBM50129684
Synonyms:3-[(1-amino-3-phenyl-propyl)-hydroxy-phosphinoyl]-2-benzyl-propionic acid | CHEMBL327844
TypeSmall organic molecule
Emp. Form.C19H24NO4P
Mol. Mass.361.3719
SMILESOC(=O)C(Cc1ccccc1)CP(O)(O)C(=N)CCc1ccccc1