Reaction Details
TargetSodium-dependent serotonin transporter
LigandBDBM50025215
Substrate/Competitorn/a
Meas. Tech.ChEMBL_1442872 (CHEMBL3377150)
EC50 53±n/a nM
Citation Blough, BELandavazo, APartilla, JSDecker, AMPage, KMBaumann, MHRothman, RB Alpha-ethyltryptamines as dual dopamine-serotonin releasers. Bioorg Med Chem Lett24:4754-8 (2014) 
 
Sodium-dependent serotonin transporter
Name:Sodium-dependent serotonin transporter
Type:Multi-pass membrane protein
Mol. Mass.:70168.43
Organism:Rattus norvegicus (rat)
Description:P31652
Residue:630
BDBM50025215
NameBDBM50025215
Synonyms:CHEMBL3330641
TypeSmall organic molecule
Emp. Form.C11H14N2
Mol. Mass.174.2423
SMILESCn1cc(CCN)c2ccccc12