Reaction Details
TargetSodium-dependent serotonin transporter
LigandBDBM30853
Substrate/Competitorn/a
Meas. Tech.ChEMBL_1442872 (CHEMBL3377150)
EC50 10±n/a nM
Citation Blough, BELandavazo, APartilla, JSDecker, AMPage, KMBaumann, MHRothman, RB Alpha-ethyltryptamines as dual dopamine-serotonin releasers. Bioorg Med Chem Lett24:4754-8 (2014) 
 
Sodium-dependent serotonin transporter
Name:Sodium-dependent serotonin transporter
Type:Multi-pass membrane protein
Mol. Mass.:70168.43
Organism:Rattus norvegicus (rat)
Description:P31652
Residue:630
BDBM30853
NameBDBM30853
Synonyms:2-(5-fluoranyl-1H-indol-3-yl)ethanamine;hydrochloride 2-(5-fluoro-1H-indol-3-yl)ethylamine;hydrochloride CHEMBL275628 SMR000033820 | cid_197774
TypeSmall organic molecule
Emp. Form.C10H11FN2
Mol. Mass.178.2061
SMILESNCCc1c[nH]c2ccc(F)cc12