Reaction Details
TargetSodium-dependent serotonin transporter
LigandBDBM50028124
Substrate/Competitorn/a
Meas. Tech.ChEMBL_1442872 (CHEMBL3377150)
EC50 54±n/a nM
Citation Blough, BELandavazo, APartilla, JSDecker, AMPage, KMBaumann, MHRothman, RB Alpha-ethyltryptamines as dual dopamine-serotonin releasers. Bioorg Med Chem Lett24:4754-8 (2014) 
 
Sodium-dependent serotonin transporter
Name:Sodium-dependent serotonin transporter
Type:Multi-pass membrane protein
Mol. Mass.:70168.43
Organism:Rattus norvegicus (rat)
Description:P31652
Residue:630
BDBM50028124
NameBDBM50028124
Synonyms:2-(6-Methoxy-1H-indol-3-yl)-ethylamine 6-MeOT | CHEMBL337825
TypeSmall organic molecule
Emp. Form.C11H14N2O
Mol. Mass.190.2417
SMILESCOc1ccc2c(CCN)c[nH]c2c1