Reaction Details
TargetSodium-dependent serotonin transporter
LigandBDBM50025197
Substrate/Competitorn/a
Meas. Tech.ChEMBL_1442872 (CHEMBL3377150)
EC50 14±n/a nM
Citation Blough, BELandavazo, APartilla, JSDecker, AMPage, KMBaumann, MHRothman, RB Alpha-ethyltryptamines as dual dopamine-serotonin releasers. Bioorg Med Chem Lett24:4754-8 (2014) 
 
Sodium-dependent serotonin transporter
Name:Sodium-dependent serotonin transporter
Type:Multi-pass membrane protein
Mol. Mass.:70168.43
Organism:Rattus norvegicus (rat)
Description:P31652
Residue:630
BDBM50025197
NameBDBM50025197
Synonyms:CHEMBL96816
TypeSmall organic molecule
Emp. Form.C11H13FN2
Mol. Mass.192.2327
SMILESCC(N)Cc1c[nH]c2ccc(F)cc12