Reaction Details
TargetKappa-type opioid receptor
LigandBDBM50025235
Substrate/Competitorn/a
Meas. Tech.ChEMBL_1431193 (CHEMBL3385056)
EC50 25±n/a nM
Citation Polepally, PRHuben, KVardy, ESetola, VMosier, PDRoth, BLZjawiony, JK Michael acceptor approach to the design of new salvinorin A-based high affinity ligands for the kappa-opioid receptor. Eur J Med Chem85:818-29 (2014) 
 
Kappa-type opioid receptor
Name:Kappa-type opioid receptor
Type:G Protein-Coupled Receptor (GPCR)
Mol. Mass.:42648.76
Organism:Homo sapiens (Human)
Description:P41145
Residue:380
BDBM50025235
NameBDBM50025235
Synonyms:CHEMBL3330665
TypeSmall organic molecule
Emp. Form.C26H32O8
Mol. Mass.472.5275
SMILES[H][C@@]12CC[C@@]3(C)[C@@H](C[C@H](OC(=O)CC(C)=C)C(=O)[C@]3([H])[C@@]1(C)C[C@H](OC2=O)c1ccoc1)C(=O)OC