Reaction Details
TargetKappa-type opioid receptor
LigandBDBM50025237
Substrate/Competitorn/a
Meas. Tech.ChEMBL_1431193 (CHEMBL3385056)
EC50 11±n/a nM
Citation Polepally, PRHuben, KVardy, ESetola, VMosier, PDRoth, BLZjawiony, JK Michael acceptor approach to the design of new salvinorin A-based high affinity ligands for the kappa-opioid receptor. Eur J Med Chem85:818-29 (2014) 
 
Kappa-type opioid receptor
Name:Kappa-type opioid receptor
Type:G Protein-Coupled Receptor (GPCR)
Mol. Mass.:42648.76
Organism:Homo sapiens (Human)
Description:P41145
Residue:380
BDBM50025237
NameBDBM50025237
Synonyms:CHEMBL3330666
TypeSmall organic molecule
Emp. Form.C25H30O8
Mol. Mass.458.5009
SMILES[H][C@@]12CC[C@@]3(C)[C@@H](C[C@H](OC(=O)\C=C\C)C(=O)[C@]3([H])[C@@]1(C)C[C@H](OC2=O)c1ccoc1)C(=O)OC